{"text_format":"1","workbook":"xlsx","n_sheets":9,"sheets":["Instructions","Register","Statement","BudgetViewer","BudgetVwr_Source","Lists","Ver_Notes","Statement (Example)","DeveloperNotes"],"not_rendered":{"charts":0,"images":5,"macros":1,"external_links":0,"defined_names":8,"comments":0,"pivot_tables":2},"unopened":[],"bounds":{"document_bytes":16777216,"sheet_cells":100000,"rows_first":2000,"rows_last":500,"rows_between":2000,"halvings":0,"cell_chars":16384,"cell_head_chars":4096},"cells_cut":0,"cells_raw":0,"read":"whole","date_system":"1900"}

{"sheet":"Instructions","index":0,"n_rows":23,"n_cols":6,"rows_kept":23,"cut":false,"hidden":false,"merged":[[4,1,4,5],[1,1,1,5],[2,1,2,5]]}
[null,null,null,"Checkbook Simulation Activity"]
[null,"Check Book Simulation Activity:  This activity provides you with an opportunity to track your expenses and deposits for a month by entering them into a transaction register.  It will provide you with an understanding of the importance of monitoring your account balance to avoid having your account fall below zero.  It also will give you an opportunity to explain the balance difference between what the bank/credit union shows and that of your transaction register.\n"]
[null,"Instructions:  Detailed below is a list of your deposits and withdrawals for a hypothetical month. The transactions are similar to the spending and saving choices you made when completing the budget activity. Follow the steps below to complete the activity.\nStep 1: Register Tab\nUse the information in the table below and enter it in the appropriate field in the checkbook register. As you enter the transactions, the balance of your account will be updated. If the balance falls below zero, it will trigger an overdraft fee.  \nStep 2:  Statement Tab\nOnce you have all of the information entered in the register, click on the Statement tab to review the transactions that have cleared.  \"Cleared\" means the bank has received the transaction and it has been reflected in your account balance. Compare your ending balance on this statement to the ending balance in your transaction register and calculate the difference. What transactions account for the difference between the two? You can use the column labeled “Cleared Y or No” on the Register tab to indicate which transactions cleared and which haven’t. Add up the transactions that have not cleared; this will be your difference from the statement balance.\nStep 3:  Budget Viewer Tab\nReview this tab to see your spending for the month.  Are there any categories you could lower to increase the amount available to save?  What are your largest spending categories?\n"]
[]
[null,"Transactions"]
[null,"Date","Transaction Type","Description","Budget Category","Amount"]
[null,"2016-09-01","Direct Deposit","Pay Day","Deposit",1350]
[null,"2016-09-01","Auto from Checking","September Rent - Due 9/1","Housing/Rent",-650]
[null,"2016-09-01","Auto to Savings","Save for Emergency Fund","Emergency Fund",-75]
[null,"2016-09-07","Debit Card","Groceries","Groceries",-125]
[null,"2016-09-08","ATM Cash","Spending Money","Entertainment",-100]
[null,"2016-09-12","Auto from Checking","Cell Phone","Other",-75]
[null,"2016-09-14","Auto from Checking","Car Loan Payment","Loan Payment",-300]
[null,"2016-09-14","Auto from Checking","Auto Insurance and Renter's Insurance","Insurance",-150]
[null,"2016-09-14","Debit Card","Oil Change","Transportation",-35]
{"$rows_left_out":9}
{"sheet":"Register","index":1,"n_rows":179,"n_cols":17,"rows_kept":179,"cut":false,"hidden":false,"merged":[[3,6,3,9],[7,13,7,14],[5,15,5,16],[1,1,1,10]]}
[]
[null,"Step 1: Register Tab\nUse the information in the table below and enter it in the appropriate field in the checkbook register.  As you enter the transactions, the balance of your account will be updated.  If the balance falls below zero, it will trigger an overdraft fee."]
[]
[null,null,null,null,"CHECK REGISTER","Student Name:","Jackie Student"]
[]
[null,null,"Starting Balance:",100,null,"Overdraft fee:",-35,null,null,null,null,null,null,null,null,"Do not delete these columns."]
[]
[null,"Date","Transaction Type","Transaction Ref.","Description","Budget Category","Cleared\nY or N","Cleared Date\n(automatic)","Withdrawal\nDebit (-)","Deposit\nCredit (+)","Balance\n(automatic)",null,null,"Do not delete these columns.",null,"Deb_Empty","Cr_Empty"]
[null,null,null,null,"Beginning Balance",null,null,null,null,null,{"$f":"D6","v":100}]
[null,"2016-09-01","Direct Deposit",null,"Pay Day","Income",null,{"$f":"IF(E10=\"OVERDRAFT\",H9,IFERROR(B10+LOOKUP(Register!C10,Trans_Type,DaysToClear),\"\"))","v":"2016-09-01"},null,1350,{"$f":"OFFSET(K10,-1,0)+J10+I10","v":1450}," x remove","  + add",{"$f":"IF(AND(OR(OFFSET(K10,-1,0)>=0,OFFSET(J10,-1,0)>0), E10=\"OVERDRAFT\"),\"REMOVE\",\"nothing\")","v":"nothing"},{"$f":"IF(AND(K10<0, E10<>\"OVERDRAFT\",OFFSET(E10,1,0)<>\"OVERDRAFT\",I10<0),\"ADD\",\"nothing\")","v":"nothing"},{"$f":"ISBLANK(I10)","v":true},{"$f":"ISBLANK(J10)","v":false}]
[null,"2016-09-01","Auto from Checking",null,"September Rent - Due 9/1","Housing/Rent",null,{"$f":"IF(E11=\"OVERDRAFT\",H10,IFERROR(B11+LOOKUP(Register!C11,Trans_Type,DaysToClear),\"\"))","v":"2016-09-01"},-650,null,{"$f":"OFFSET(K11,-1,0)+J11+I11","v":800}," x remove","  + add",{"$f":"IF(AND(OR(OFFSET(K11,-1,0)>=0,OFFSET(J11,-1,0)>0), E11=\"OVERDRAFT\"),\"REMOVE\",\"nothing\")","v":"nothing"},{"$f":"IF(AND(K11<0, E11<>\"OVERDRAFT\",OFFSET(E11,1,0)<>\"OVERDRAFT\",I11<0),\"ADD\",\"nothing\")","v":"nothing"},{"$f":"ISBLANK(I11)","v":false},{"$f":"ISBLANK(J11)","v":true}]
[null,"2016-09-01","Auto to Savings",null,"Save for Emergency Fund","Emergency Fund",null,{"$f":"IF(E12=\"OVERDRAFT\",H11,IFERROR(B12+LOOKUP(Register!C12,Trans_Type,DaysToClear),\"\"))","v":"2016-09-01"},-75,null,725," x remove","  + add","nothing","nothing",false,true]
[null,"2016-09-07","Debit Card",null,"Groceries","Groceries",null,{"$f":"IF(E13=\"OVERDRAFT\",H12,IFERROR(B13+LOOKUP(Register!C13,Trans_Type,DaysToClear),\"\"))","v":"2016-09-07"},-125,null,600," x remove","  + add","nothing","nothing",false,true]
[null,"2016-09-08","ATM Cash",null,"Spending Money","Entertainment",null,{"$f":"IF(E14=\"OVERDRAFT\",H13,IFERROR(B14+LOOKUP(Register!C14,Trans_Type,DaysToClear),\"\"))","v":"2016-09-08"},-100,null,500," x remove","  + add","nothing","nothing",false,true]
[null,"2016-09-12","Auto from Checking",null,"Cell Phone","Utilities",null,{"$f":"IF(E15=\"OVERDRAFT\",H14,IFERROR(B15+LOOKUP(Register!C15,Trans_Type,DaysToClear),\"\"))","v":"2016-09-12"},-75,null,425," x remove","  + add","nothing","nothing",false,true]
{"$rows_left_out":165}
{"sheet":"Statement","index":2,"n_rows":44,"n_cols":6,"rows_kept":44,"cut":false,"hidden":false,"merged":[[6,4,9,5],[1,1,1,5]]}
[]
[null,"Step 2:  Statement Tab\nOnce you have all of the information entered in the register, click on the Statement tab to review the transactions that have cleared.  \"Cleared\" means the bank has received the transaction and it has been reflected in your account balance. Compare your ending balance on this statement to the ending balance in your transaction register and calculate the difference. What transactions account for the difference between the two? You can use the column labeled “Cleared Y or No” on the check register to indicate which transactions cleared and which haven’t. Add up the transactions that have not cleared; this will be your difference from the statement balance. The statement month can be selected using the filter on row 13."]
[]
[null,null,null,null,"My  Bank"]
[null,null,null,null,"Monthly Statement"]
[]
[null,"Beginning Balance",{"$f":"Register!K9+AVERAGEIF(BudgetVwr_Source!K4:K150,\"=\"&C13,BudgetVwr_Source!P4:P150)","v":100}]
[null,"Total Credits",{"$f":"IFERROR(GETPIVOTDATA(\"Amount\",$B$15,\"Credit_Debit\",\"Credit\"),0)","v":2700}]
[null,"Total Debits",{"$f":"IFERROR(GETPIVOTDATA(\"Amount\",$B$15,\"Credit_Debit\",\"Debit\"),0)","v":-2230}]
[null,"Ending Balance",{"$f":"SUM(C7:C9)","v":570}]
[]
[]
[null,"Statement Month","Sep-2016",null,"(adjust filter as desired)"]
[]
[null,"Row Labels","Clear_Date","Date","Description","Sum of Amount"]
{"$rows_left_out":30}
{"sheet":"BudgetViewer","index":3,"n_rows":50,"n_cols":6,"rows_kept":50,"cut":false,"hidden":false,"merged":[[1,1,1,5]]}
[]
[null,"Step 3:  Budget Viewer Tab\nReview this tab to see your spending for the month.  Are there any categories you could lower to increase the amount available to save?  What are your largest spending categories?"]
[]
[null,null,null,"BUDGET VIEWER"]
[null,null,null,"Categories by month"]
[]
[]
[null,"Empty","N"]
[]
[null,"Sum of Amount",null,null,"Column Labels"]
[null,"Category","Date","Description","September - 16","Grand Total"]
[null,"Bank Fee",null,null,-70,-70]
[null,null,"2016-09-14","OVERDRAFT",-70,-70]
[]
[null,"Emergency Fund",null,null,-75,-75]
{"$rows_left_out":36}
{"sheet":"BudgetVwr_Source","index":4,"n_rows":150,"n_cols":16,"rows_kept":150,"cut":false,"hidden":true,"merged":[]}
["For Budget viewer",null,"DO NOT DELETE"]
[]
["Year","Month","Amount","Date","Category","Type","Description","Empty","Clear_Date","Clear_YM","Statement Month","Clear_Year","Debit","Credit","Credit_Debit","Upto_M_bal"]
[{"$f":"YEAR(Register!B10)","v":2016},{"$f":"TEXT(Register!B10,\"mmmm - yy\")","v":"September - 16"},{"$f":"Register!I10+Register!J10","v":1350},{"$f":"IF(Register!B10=\"\",\"\",Register!B10)","v":"2016-09-01"},{"$f":"IF(Register!F10=\"\",\"(blank line)\",Register!F10)","v":"Income"},{"$f":"Register!C10","v":"Direct Deposit"},{"$f":"IF(Register!D10=\"\",IF(Register!E10=\"\",\"(empty description)\",Register!E10),CONCATENATE(Register!D10,\" - \",Register!E10))","v":"Pay Day"},{"$f":"IF(C4=0,\"Y\",\"N\")","v":"N"},{"$f":"Register!H10","v":"2016-09-01"},{"$f":"L4*100+MONTH(I4)","v":201609},{"$f":"TEXT(Register!H10,\"mmm-yyyy\")","v":"Sep-2016"},{"$f":"YEAR(Register!H10)","v":2016},{"$f":"Register!I10","v":0},{"$f":"Register!J10","v":1350},{"$f":"IF(M4<0,\"Debit\",\"Credit\")","v":"Credit"},{"$f":"SUMIF(J$4:J$150,\"<\"&J4,C$4:C$150)","v":0}]
[{"$f":"YEAR(Register!B11)","v":2016},{"$f":"TEXT(Register!B11,\"mmmm - yy\")","v":"September - 16"},{"$f":"Register!I11+Register!J11","v":-650},{"$f":"IF(Register!B11=\"\",\"\",Register!B11)","v":"2016-09-01"},{"$f":"IF(Register!F11=\"\",\"(blank line)\",Register!F11)","v":"Housing/Rent"},{"$f":"Register!C11","v":"Auto from Checking"},{"$f":"IF(Register!D11=\"\",IF(Register!E11=\"\",\"(empty description)\",Register!E11),CONCATENATE(Register!D11,\" - \",Register!E11))","v":"September Rent - Due 9/1"},{"$f":"IF(C5=0,\"Y\",\"N\")","v":"N"},{"$f":"Register!H11","v":"2016-09-01"},{"$f":"L5*100+MONTH(I5)","v":201609},{"$f":"TEXT(Register!H11,\"mmm-yyyy\")","v":"Sep-2016"},{"$f":"YEAR(Register!H11)","v":2016},{"$f":"Register!I11","v":-650},{"$f":"Register!J11","v":0},{"$f":"IF(M5<0,\"Debit\",\"Credit\")","v":"Debit"},{"$f":"SUMIF(J$4:J$150,\"<\"&J5,C$4:C$150)","v":0}]
[{"$f":"YEAR(Register!B12)","v":2016},{"$f":"TEXT(Register!B12,\"mmmm - yy\")","v":"September - 16"},{"$f":"Register!I12+Register!J12","v":-75},{"$f":"IF(Register!B12=\"\",\"\",Register!B12)","v":"2016-09-01"},{"$f":"IF(Register!F12=\"\",\"(blank line)\",Register!F12)","v":"Emergency Fund"},{"$f":"Register!C12","v":"Auto to Savings"},{"$f":"IF(Register!D12=\"\",IF(Register!E12=\"\",\"(empty description)\",Register!E12),CONCATENATE(Register!D12,\" - \",Register!E12))","v":"Save for Emergency Fund"},"N",{"$f":"Register!H12","v":"2016-09-01"},201609,{"$f":"TEXT(Register!H12,\"mmm-yyyy\")","v":"Sep-2016"},{"$f":"YEAR(Register!H12)","v":2016},{"$f":"Register!I12","v":-75},{"$f":"Register!J12","v":0},"Debit",0]
[{"$f":"YEAR(Register!B13)","v":2016},{"$f":"TEXT(Register!B13,\"mmmm - yy\")","v":"September - 16"},{"$f":"Register!I13+Register!J13","v":-125},{"$f":"IF(Register!B13=\"\",\"\",Register!B13)","v":"2016-09-07"},{"$f":"IF(Register!F13=\"\",\"(blank line)\",Register!F13)","v":"Groceries"},{"$f":"Register!C13","v":"Debit Card"},{"$f":"IF(Register!D13=\"\",IF(Register!E13=\"\",\"(empty description)\",Register!E13),CONCATENATE(Register!D13,\" - \",Register!E13))","v":"Groceries"},"N",{"$f":"Register!H13","v":"2016-09-07"},201609,{"$f":"TEXT(Register!H13,\"mmm-yyyy\")","v":"Sep-2016"},{"$f":"YEAR(Register!H13)","v":2016},{"$f":"Register!I13","v":-125},{"$f":"Register!J13","v":0},"Debit",0]
[{"$f":"YEAR(Register!B14)","v":2016},{"$f":"TEXT(Register!B14,\"mmmm - yy\")","v":"September - 16"},{"$f":"Register!I14+Register!J14","v":-100},{"$f":"IF(Register!B14=\"\",\"\",Register!B14)","v":"2016-09-08"},{"$f":"IF(Register!F14=\"\",\"(blank line)\",Register!F14)","v":"Entertainment"},{"$f":"Register!C14","v":"ATM Cash"},{"$f":"IF(Register!D14=\"\",IF(Register!E14=\"\",\"(empty description)\",Register!E14),CONCATENATE(Register!D14,\" - \",Register!E14))","v":"Spending Money"},"N",{"$f":"Register!H14","v":"2016-09-08"},201609,{"$f":"TEXT(Register!H14,\"mmm-yyyy\")","v":"Sep-2016"},{"$f":"YEAR(Register!H14)","v":2016},{"$f":"Register!I14","v":-100},{"$f":"Register!J14","v":0},"Debit",0]
[{"$f":"YEAR(Register!B15)","v":2016},{"$f":"TEXT(Register!B15,\"mmmm - yy\")","v":"September - 16"},{"$f":"Register!I15+Register!J15","v":-75},{"$f":"IF(Register!B15=\"\",\"\",Register!B15)","v":"2016-09-12"},{"$f":"IF(Register!F15=\"\",\"(blank line)\",Register!F15)","v":"Utilities"},{"$f":"Register!C15","v":"Auto from Checking"},{"$f":"IF(Register!D15=\"\",IF(Register!E15=\"\",\"(empty description)\",Register!E15),CONCATENATE(Register!D15,\" - \",Register!E15))","v":"Cell Phone"},"N",{"$f":"Register!H15","v":"2016-09-12"},201609,{"$f":"TEXT(Register!H15,\"mmm-yyyy\")","v":"Sep-2016"},{"$f":"YEAR(Register!H15)","v":2016},{"$f":"Register!I15","v":-75},{"$f":"Register!J15","v":0},"Debit",0]
[{"$f":"YEAR(Register!B16)","v":2016},{"$f":"TEXT(Register!B16,\"mmmm - yy\")","v":"September - 16"},{"$f":"Register!I16+Register!J16","v":-300},{"$f":"IF(Register!B16=\"\",\"\",Register!B16)","v":"2016-09-14"},{"$f":"IF(Register!F16=\"\",\"(blank line)\",Register!F16)","v":"Loan Payment"},{"$f":"Register!C16","v":"Auto from Checking"},{"$f":"IF(Register!D16=\"\",IF(Register!E16=\"\",\"(empty description)\",Register!E16),CONCATENATE(Register!D16,\" - \",Register!E16))","v":"Car Loan Payment"},"N",{"$f":"Register!H16","v":"2016-09-14"},201609,{"$f":"TEXT(Register!H16,\"mmm-yyyy\")","v":"Sep-2016"},{"$f":"YEAR(Register!H16)","v":2016},{"$f":"Register!I16","v":-300},{"$f":"Register!J16","v":0},"Debit",0]
[{"$f":"YEAR(Register!B17)","v":2016},{"$f":"TEXT(Register!B17,\"mmmm - yy\")","v":"September - 16"},{"$f":"Register!I17+Register!J17","v":-150},{"$f":"IF(Register!B17=\"\",\"\",Register!B17)","v":"2016-09-14"},{"$f":"IF(Register!F17=\"\",\"(blank line)\",Register!F17)","v":"Insurance"},{"$f":"Register!C17","v":"Auto from Checking"},{"$f":"IF(Register!D17=\"\",IF(Register!E17=\"\",\"(empty description)\",Register!E17),CONCATENATE(Register!D17,\" - \",Register!E17))","v":"Auto Insurance and Renter's Insurance"},"N",{"$f":"Register!H17","v":"2016-09-14"},201609,{"$f":"TEXT(Register!H17,\"mmm-yyyy\")","v":"Sep-2016"},{"$f":"YEAR(Register!H17)","v":2016},{"$f":"Register!I17","v":-150},{"$f":"Register!J17","v":0},"Debit",0]
[{"$f":"YEAR(Register!B18)","v":2016},{"$f":"TEXT(Register!B18,\"mmmm - yy\")","v":"September - 16"},{"$f":"Register!I18+Register!J18","v":-35},{"$f":"IF(Register!B18=\"\",\"\",Register!B18)","v":"2016-09-14"},{"$f":"IF(Register!F18=\"\",\"(blank line)\",Register!F18)","v":"Bank Fee"},{"$f":"Register!C18","v":"Bank Fee"},{"$f":"IF(Register!D18=\"\",IF(Register!E18=\"\",\"(empty description)\",Register!E18),CONCATENATE(Register!D18,\" - \",Register!E18))","v":"OVERDRAFT"},"N",{"$f":"Register!H18","v":"2016-09-14"},201609,{"$f":"TEXT(Register!H18,\"mmm-yyyy\")","v":"Sep-2016"},{"$f":"YEAR(Register!H18)","v":2016},{"$f":"Register!I18","v":-35},{"$f":"Register!J18","v":0},"Debit",0]
[{"$f":"YEAR(Register!B19)","v":2016},{"$f":"TEXT(Register!B19,\"mmmm - yy\")","v":"September - 16"},{"$f":"Register!I19+Register!J19","v":-35},{"$f":"IF(Register!B19=\"\",\"\",Register!B19)","v":"2016-09-14"},{"$f":"IF(Register!F19=\"\",\"(blank line)\",Register!F19)","v":"Travel"},{"$f":"Register!C19","v":"Debit Card"},{"$f":"IF(Register!D19=\"\",IF(Register!E19=\"\",\"(empty description)\",Register!E19),CONCATENATE(Register!D19,\" - \",Register!E19))","v":"Oil Change"},"N",{"$f":"Register!H19","v":"2016-09-14"},201609,{"$f":"TEXT(Register!H19,\"mmm-yyyy\")","v":"Sep-2016"},{"$f":"YEAR(Register!H19)","v":2016},{"$f":"Register!I19","v":-35},{"$f":"Register!J19","v":0},"Debit",0]
[{"$f":"YEAR(Register!B20)","v":2016},{"$f":"TEXT(Register!B20,\"mmmm - yy\")","v":"September - 16"},{"$f":"Register!I20+Register!J20","v":-35},{"$f":"IF(Register!B20=\"\",\"\",Register!B20)","v":"2016-09-14"},{"$f":"IF(Register!F20=\"\",\"(blank line)\",Register!F20)","v":"Bank Fee"},{"$f":"Register!C20","v":"Bank Fee"},{"$f":"IF(Register!D20=\"\",IF(Register!E20=\"\",\"(empty description)\",Register!E20),CONCATENATE(Register!D20,\" - \",Register!E20))","v":"OVERDRAFT"},"N",{"$f":"Register!H20","v":"2016-09-14"},201609,{"$f":"TEXT(Register!H20,\"mmm-yyyy\")","v":"Sep-2016"},{"$f":"YEAR(Register!H20)","v":2016},{"$f":"Register!I20","v":-35},{"$f":"Register!J20","v":0},"Debit",0]
[{"$f":"YEAR(Register!B21)","v":2016},{"$f":"TEXT(Register!B21,\"mmmm - yy\")","v":"September - 16"},{"$f":"Register!I21+Register!J21","v":1350},{"$f":"IF(Register!B21=\"\",\"\",Register!B21)","v":"2016-09-15"},{"$f":"IF(Register!F21=\"\",\"(blank line)\",Register!F21)","v":"Income"},{"$f":"Register!C21","v":"Direct Deposit"},{"$f":"IF(Register!D21=\"\",IF(Register!E21=\"\",\"(empty description)\",Register!E21),CONCATENATE(Register!D21,\" - \",Register!E21))","v":"Pay Day"},"N",{"$f":"Register!H21","v":"2016-09-15"},201609,{"$f":"TEXT(Register!H21,\"mmm-yyyy\")","v":"Sep-2016"},{"$f":"YEAR(Register!H21)","v":2016},{"$f":"Register!I21","v":0},{"$f":"Register!J21","v":1350},"Credit",0]
{"$rows_left_out":136}
{"sheet":"Lists","index":5,"n_rows":21,"n_cols":6,"rows_kept":21,"cut":false,"hidden":true,"merged":[]}
["Trans_Category",null,"Trans_Type","Days to Clear",null,"Cleared"]
["Bank Fee",null,"ATM Cash",0,null,"Y"]
["Clothing",null,"Auto from Checking",0,null,"N"]
["Deposit",null,"Auto to Savings",0]
["Donations",null,"Bank Fee",0]
["Emergency Fund",null,"Check",5]
["Entertainment",null,"Debit Card",0]
["Groceries",null,"Deposit",0]
["Household stuff",null,"Direct Deposit",0]
["Housing/Rent"]
["Income"]
["Insurance"]
["Loan Payment"]
["Medical"]
["Other"]
{"$rows_left_out":7}
{"sheet":"Ver_Notes","index":6,"n_rows":32,"n_cols":2,"rows_kept":32,"cut":false,"hidden":true,"merged":[]}
[]
[]
["v30"," - \"Cleared date\" column is present but hidden in Register"]
["(7/24/2016)"," - Statement no sorts by date asc in the pivot table"]
[]
["v29"," - added instructions page at beginning"]
["(7/22/2016)"," - added instruction to the top of register, statement, budget"]
[null," - updated the VB scripts for the row changes"]
[]
["v28"," - consolidated AddNew and RemoveFalse to CleanUpOverdrafts"]
["(7/17/2016)"," - added \"RefreshBudget\" when clear transactions"]
[]
["v27 "," - added \"data validation\" to the \"Cleared Y or N\" column, based on Y,N list "]
[null," - set \"Cleared Y or N\" to be editable (not locked)"]
[null," - added code to refresh \"Cleared date\" column after AddOverdrafts (sometimes gets messed up)"]
{"$rows_left_out":18}
{"sheet":"Statement (Example)","index":7,"n_rows":23,"n_cols":4,"rows_kept":23,"cut":false,"hidden":true,"merged":[]}
[null,"My Personal Bank"]
[]
["Statement","9/1/16 - 9/30/16"]
[]
["Description",null,"Summary Amt."]
["Beginning balance as of 05/18/2011",null,73.06]
["Total credits",null,1900.77]
["Total debits",null,-1301.22]
["Ending balance as of 06/09/2011",null,672.61]
[]
["Date","Description","Amount","Running Bal."]
["2011-05-18","Beginning balance as of 05/18/2011",null,73.06]
["2011-05-18","JPMorgan Chase DES:Ext Trnsfr ID:2065436997 INDN: CO ID:9200",300,373.06]
["2011-05-19","Online Banking transfer to Sav 9648 Confirmation# 4084516884",-150,223.06]
["2011-05-23","Counter Credit",100,323.06]
{"$rows_left_out":9}
{"sheet":"DeveloperNotes","index":8,"n_rows":45,"n_cols":1,"rows_kept":45,"cut":false,"hidden":true,"merged":[]}
[]
["Worksheets"]
["Register – Main worksheet to be used by the student."]
["Statement – A “pivot” view of data on the BudgetVwr_Source worksheet, providing a simulated bank statement."]
["BudgetViewer – Also a “pivot” view of data on the BudgetVwr_Source worksheet, providing a display by budget category."]
["BudgetVwr_Source – to be hidden and not visible to the student. This is a copy of the Register with extra columns to keep track of the date the transaction “cleared”. Which can be different from the transaction date."]
["Lists – to be hidden and not visible to the student.  These are the lists used for the dropdowns in Register and the “Days to Clear”.  There is also a “Statement Ranges” list that I had thought of using for the statement, but am using filters on the pivot views instead."]
["Statement (Example) – to be hidden and not visible to the student.  Something I was using to think about how a statement could look."]
["DeveloperNotes - to be hidden and not visible to the student.  Where these notes and others could reside."]
[]
["VBA subroutine notes"]
["Two “Private” subroutines associated with “Sheet1” (Register).  They run automatically and activate on all activity on the page."]
["-          Worksheet_Change  - detects when anything changes in columns I and J (debits and credits).  It then calls the “ProcessOverdrafts” subroutine."]
["-          Worksheet_SelectionChange – detects when the user clicks on the add or remove cells, and calls the corresponding subrouting (AddRow or RemoveRow)"]
["-           "]
{"$rows_left_out":30}